Welcome! Log In Create A New Profile

Advanced

Also failing tests of 1.4.5 on Solaris 9 Sparc

Posted by Dagobert Michelsen 
Dagobert Michelsen
Also failing tests of 1.4.5 on Solaris 9 Sparc
August 12, 2010 11:51AM
Hi,

I just tried to compile memcached on Solaris 9 Sparc from the OpenCSW
buildfarm and got
also some errors during testing:

<29 server listening (udp)
<29 server listening (udp)
<30 new binary client connection.
<30 connection closed.
Invalid value for binding protocol: http
-- should be one of auto, binary, or ascii
t/00-startup.t ....... 17/18 Number of threads must be greater than 0
t/00-startup.t ....... ok
t/64bit.t ............ skipped: Skipping 64-bit tests on 32-bit build
t/binary-get.t ....... ok
t/binary-sasl.t ...... This server is not built with SASL support.
t/binary-sasl.t ...... ok
t/binary.t ........... 2/3361
# Failed test 'Expected read length'
# at t/binary.t line 539.
# got: '8'
# expected: '24'
Use of uninitialized value $ident_hi in multiplication (*) at t/
binary.t line 545.
Use of uninitialized value $ident_lo in addition (+) at t/binary.t
line 545.
Use of uninitialized value $remaining in numeric eq (==) at t/binary.t
line 547.

# Failed test 'Expected read length'
# at t/binary.t line 539.
# got: '16'
# expected: '24'

# Failed test 'Got proper response magic'
# at t/binary.t line 543.
# got: '0'
# expected: '129'
Use of uninitialized value $ident_hi in multiplication (*) at t/
binary.t line 545.
Use of uninitialized value $ident_lo in addition (+) at t/binary.t
line 545.

# Failed test 'Flags is set properly'
# at t/binary.t line 63.
# got: undef
# expected: '19'
Argument "somevalue" isn't numeric in numeric eq (==) at t/binary.t
line 64.
Argument "" isn't numeric in numeric eq (==) at t/binary.t line 64.

# Failed test 'Expected opaque'
# at t/binary.t line 560.
# got: '4197732150'
# expected: '3383607077'

# Failed test 'Didn't get a result from get'
# at t/binary.t line 76.
# got: '3'
# expected: '0'
Can't call method "not_found" without a package or object reference at
t/binary.t line 77.
# Looks like you planned 3361 tests but ran 258.
# Looks like you failed 6 tests of 258 run.
# Looks like your test exited with 255 just after 258.
t/binary.t ........... Dubious, test returned 255 (wstat 65280, 0xff00)
Failed 3109/3361 subtests
t/bogus-commands.t ... ok
t/cas.t .............. ok
t/daemonize.t ........ ok
t/dash-M.t ........... ok
t/evictions.t ........ ok
t/expirations.t ...... ok
t/flags.t ............ ok
t/flush-all.t ........ ok
t/getset.t ........... ok
t/incrdecr.t ......... ok
t/issue_104.t ........ ok
t/issue_108.t ........ ok
t/issue_14.t ......... ok
t/issue_22.t ......... ok
t/issue_29.t ......... ok
t/issue_3.t .......... ok
t/issue_41.t ......... ok
t/issue_42.t ......... ok
t/issue_50.t ......... ok
t/issue_61.t ......... ok
t/issue_67.t ......... ok
t/issue_68.t ......... ok
t/issue_70.t ......... ok
t/item_size_max.t .... 1/7 Item max size cannot be less than 1024 bytes.
t/item_size_max.t .... 2/7 Cannot set item size limit higher than 128
mb.
t/item_size_max.t .... 4/7 WARNING: Setting item max size above 1MB is
not recommended!
Raising this limit increases the minimum memory requirements
and will decrease your memory efficiency.
WARNING: Setting item max size above 1MB is not recommended!
Raising this limit increases the minimum memory requirements
and will decrease your memory efficiency.
t/item_size_max.t .... ok
t/line-lengths.t ..... ok
t/lru.t .............. ok
t/maxconns.t ......... ok
t/multiversioning.t .. ok
t/noreply.t .......... ok
t/stats-detail.t ..... ok
t/stats.t ............ ok
t/udp.t .............. ok
t/unixsocket.t ....... ok
t/whitespace.t ....... 1/168
# Failed test 'Makefile (see devtools/clean-whitespace.pl)'
# at t/whitespace.t line 39.

# Failed test 'config.h (see devtools/clean-whitespace.pl)'
# at t/whitespace.t line 39.

# Failed test 'config.log (see devtools/clean-whitespace.pl)'
# at t/whitespace.t line 39.

# Failed test 'config.status (see devtools/clean-whitespace.pl)'
# at t/whitespace.t line 39.

# Failed test 'memcached (see devtools/clean-whitespace.pl)'
# at t/whitespace.t line 39.

# Failed test 'memcached-assoc.o (see devtools/clean-whitespace.pl)'
# at t/whitespace.t line 39.

# Failed test 'memcached-daemon.o (see devtools/clean-whitespace.pl)'
# at t/whitespace.t line 39.

# Failed test 'memcached-debug (see devtools/clean-whitespace.pl)'
# at t/whitespace.t line 39.

# Failed test 'memcached-debug.profile/tcovd (see devtools/clean-
whitespace.pl)'
# at t/whitespace.t line 39.

# Failed test 'memcached-hash.o (see devtools/clean-whitespace.pl)'
# at t/whitespace.t line 39.

# Failed test 'memcached-items.o (see devtools/clean-whitespace.pl)'
# at t/whitespace.t line 39.

# Failed test 'memcached-memcached.o (see devtools/clean-
whitespace.pl)'
# at t/whitespace.t line 39.

# Failed test 'memcached-slabs.o (see devtools/clean-whitespace.pl)'
# at t/whitespace.t line 39.

# Failed test 'memcached-stats.o (see devtools/clean-whitespace.pl)'
# at t/whitespace.t line 39.

# Failed test 'memcached-thread.o (see devtools/clean-whitespace.pl)'
# at t/whitespace.t line 39.

# Failed test 'memcached-util.o (see devtools/clean-whitespace.pl)'
# at t/whitespace.t line 39.

# Failed test 'memcached_debug-assoc.o (see devtools/clean-
whitespace.pl)'
# at t/whitespace.t line 39.

# Failed test 'memcached_debug-daemon.o (see devtools/clean-
whitespace.pl)'
# at t/whitespace.t line 39.

# Failed test 'memcached_debug-hash.o (see devtools/clean-
whitespace.pl)'
# at t/whitespace.t line 39.

# Failed test 'memcached_debug-items.o (see devtools/clean-
whitespace.pl)'
# at t/whitespace.t line 39.

# Failed test 'memcached_debug-memcached.o (see devtools/clean-
whitespace.pl)'
# at t/whitespace.t line 39.

# Failed test 'memcached_debug-slabs.o (see devtools/clean-
whitespace.pl)'
# at t/whitespace.t line 39.

# Failed test 'memcached_debug-stats.o (see devtools/clean-
whitespace.pl)'
# at t/whitespace.t line 39.

# Failed test 'memcached_debug-thread.o (see devtools/clean-
whitespace.pl)'
# at t/whitespace.t line 39.

# Failed test 'memcached_debug-util.o (see devtools/clean-
whitespace.pl)'
# at t/whitespace.t line 39.

# Failed test 'sizes (see devtools/clean-whitespace.pl)'
# at t/whitespace.t line 39.

# Failed test 'sizes.o (see devtools/clean-whitespace.pl)'
# at t/whitespace.t line 39.

# Failed test 'testapp (see devtools/clean-whitespace.pl)'
# at t/whitespace.t line 39.

# Failed test 'testapp.o (see devtools/clean-whitespace.pl)'
# at t/whitespace.t line 39.

# Failed test 'timedrun (see devtools/clean-whitespace.pl)'
# at t/whitespace.t line 39.

# Failed test 'timedrun.o (see devtools/clean-whitespace.pl)'
# at t/whitespace.t line 39.

# Failed test 'util.o (see devtools/clean-whitespace.pl)'
# at t/whitespace.t line 39.

# Failed test 'Makefile.in (see devtools/clean-whitespace.pl)'
# at t/whitespace.t line 39.

# Failed test 'aclocal.m4 (see devtools/clean-whitespace.pl)'
# at t/whitespace.t line 39.

# Failed test 'compile (see devtools/clean-whitespace.pl)'
# at t/whitespace.t line 39.

# Failed test 'config.guess (see devtools/clean-whitespace.pl)'
# at t/whitespace.t line 39.

# Failed test 'config.h.in (see devtools/clean-whitespace.pl)'
# at t/whitespace.t line 39.

# Failed test 'config.sub (see devtools/clean-whitespace.pl)'
# at t/whitespace.t line 39.

# Failed test 'configure (see devtools/clean-whitespace.pl)'
# at t/whitespace.t line 39.

# Failed test 'depcomp (see devtools/clean-whitespace.pl)'
# at t/whitespace.t line 39.

# Failed test 'doc/Makefile (see devtools/clean-whitespace.pl)'
# at t/whitespace.t line 39.

# Failed test 'doc/Makefile.in (see devtools/clean-whitespace.pl)'
# at t/whitespace.t line 39.

# Failed test 'install-sh (see devtools/clean-whitespace.pl)'
# at t/whitespace.t line 39.

# Failed test 'missing (see devtools/clean-whitespace.pl)'
# at t/whitespace.t line 39.
t/whitespace.t ....... 152/168
# Failed test 'doc/Makefile (see devtools/clean-whitespace.pl)'
# at t/whitespace.t line 39.
# Looks like you failed 45 tests of 168.
t/whitespace.t ....... Dubious, test returned 45 (wstat 11520, 0x2d00)
Failed 45/168 subtests

Test Summary Report
-------------------
t/binary.t (Wstat: 65280 Tests: 258 Failed: 6)
Failed tests: 240, 243-244, 251, 255, 258
Non-zero exit status: 255
Parse errors: Bad plan. You planned 3361 tests but ran 258.
t/whitespace.t (Wstat: 11520 Tests: 168 Failed: 45)
Failed tests: 30-56, 58-62, 65, 68, 73-77, 80, 83-84
95, 102, 168
Non-zero exit status: 45
Files=39, Tests=3540, 79 wallclock secs ( 8.33 usr 0.73 sys + 35.99
cusr 13.22 csys = 58.27 CPU)
Result: FAIL
gmake[2]: *** [test] Error 1
gmake[2]: Leaving directory `/home/dam/mgar/pkg/memcached/trunk/work/
solaris9-sparc/build-isa-sparcv8/memcached-1.4.5'
gmake[1]: *** [test-work/solaris9-sparc/build-isa-sparcv8/
memcached-1.4.5/Makefile] Error 2
gmake[1]: Leaving directory `/home/dam/mgar/pkg/memcached/trunk'
gmake: *** [merge-isa-sparcv8] Error 2


Best regards

-- Dago
We don't have anyone working on sparc at the moment. Would love
fixes. :)

On Aug 11, 11:47 pm, Dagobert Michelsen <[email protected]> wrote:
> Hi,
>
> I just tried to compile memcached on Solaris 9 Sparc from the OpenCSW  
> buildfarm and got
> also some errors during testing:
>
> <29 server listening (udp)
> <29 server listening (udp)
> <30 new binary client connection.
> <30 connection closed.
> Invalid value for binding protocol: http
>   -- should be one of auto, binary, or ascii
> t/00-startup.t ....... 17/18 Number of threads must be greater than 0
> t/00-startup.t ....... ok
> t/64bit.t ............ skipped: Skipping 64-bit tests on 32-bit build
> t/binary-get.t ....... ok
> t/binary-sasl.t ...... This server is not built with SASL support.
> t/binary-sasl.t ...... ok
> t/binary.t ........... 2/3361
> #   Failed test 'Expected read length'
> #   at t/binary.t line 539.
> #          got: '8'
> #     expected: '24'
> Use of uninitialized value $ident_hi in multiplication (*) at t/
> binary.t line 545.
> Use of uninitialized value $ident_lo in addition (+) at t/binary.t  
> line 545.
> Use of uninitialized value $remaining in numeric eq (==) at t/binary.t  
> line 547.
>
> #   Failed test 'Expected read length'
> #   at t/binary.t line 539.
> #          got: '16'
> #     expected: '24'
>
> #   Failed test 'Got proper response magic'
> #   at t/binary.t line 543.
> #          got: '0'
> #     expected: '129'
> Use of uninitialized value $ident_hi in multiplication (*) at t/
> binary.t line 545.
> Use of uninitialized value $ident_lo in addition (+) at t/binary.t  
> line 545.
>
> #   Failed test 'Flags is set properly'
> #   at t/binary.t line 63.
> #          got: undef
> #     expected: '19'
> Argument "somevalue" isn't numeric in numeric eq (==) at t/binary.t  
> line 64.
> Argument "" isn't numeric in numeric eq (==) at t/binary.t line 64.
>
> #   Failed test 'Expected opaque'
> #   at t/binary.t line 560.
> #          got: '4197732150'
> #     expected: '3383607077'
>
> #   Failed test 'Didn't get a result from get'
> #   at t/binary.t line 76.
> #          got: '3'
> #     expected: '0'
> Can't call method "not_found" without a package or object reference at  
> t/binary.t line 77.
> # Looks like you planned 3361 tests but ran 258.
> # Looks like you failed 6 tests of 258 run.
> # Looks like your test exited with 255 just after 258.
> t/binary.t ........... Dubious, test returned 255 (wstat 65280, 0xff00)
> Failed 3109/3361 subtests
> t/bogus-commands.t ... ok
> t/cas.t .............. ok
> t/daemonize.t ........ ok
> t/dash-M.t ........... ok
> t/evictions.t ........ ok
> t/expirations.t ...... ok
> t/flags.t ............ ok
> t/flush-all.t ........ ok
> t/getset.t ........... ok
> t/incrdecr.t ......... ok
> t/issue_104.t ........ ok
> t/issue_108.t ........ ok
> t/issue_14.t ......... ok
> t/issue_22.t ......... ok
> t/issue_29.t ......... ok
> t/issue_3.t .......... ok
> t/issue_41.t ......... ok
> t/issue_42.t ......... ok
> t/issue_50.t ......... ok
> t/issue_61.t ......... ok
> t/issue_67.t ......... ok
> t/issue_68.t ......... ok
> t/issue_70.t ......... ok
> t/item_size_max.t .... 1/7 Item max size cannot be less than 1024 bytes.
> t/item_size_max.t .... 2/7 Cannot set item size limit higher than 128  
> mb.
> t/item_size_max.t .... 4/7 WARNING: Setting item max size above 1MB is  
> not recommended!
>   Raising this limit increases the minimum memory requirements
>   and will decrease your memory efficiency.
> WARNING: Setting item max size above 1MB is not recommended!
>   Raising this limit increases the minimum memory requirements
>   and will decrease your memory efficiency.
> t/item_size_max.t .... ok
> t/line-lengths.t ..... ok
> t/lru.t .............. ok
> t/maxconns.t ......... ok
> t/multiversioning.t .. ok
> t/noreply.t .......... ok
> t/stats-detail.t ..... ok
> t/stats.t ............ ok
> t/udp.t .............. ok
> t/unixsocket.t ....... ok
> t/whitespace.t ....... 1/168
> #   Failed test 'Makefile (see devtools/clean-whitespace.pl)'
> #   at t/whitespace.t line 39.
>
> #   Failed test 'config.h (see devtools/clean-whitespace.pl)'
> #   at t/whitespace.t line 39.
>
> #   Failed test 'config.log (see devtools/clean-whitespace.pl)'
> #   at t/whitespace.t line 39.
>
> #   Failed test 'config.status (see devtools/clean-whitespace.pl)'
> #   at t/whitespace.t line 39.
>
> #   Failed test 'memcached (see devtools/clean-whitespace.pl)'
> #   at t/whitespace.t line 39.
>
> #   Failed test 'memcached-assoc.o (see devtools/clean-whitespace.pl)'
> #   at t/whitespace.t line 39.
>
> #   Failed test 'memcached-daemon.o (see devtools/clean-whitespace.pl)'
> #   at t/whitespace.t line 39.
>
> #   Failed test 'memcached-debug (see devtools/clean-whitespace.pl)'
> #   at t/whitespace.t line 39.
>
> #   Failed test 'memcached-debug.profile/tcovd (see devtools/clean-
> whitespace.pl)'
> #   at t/whitespace.t line 39.
>
> #   Failed test 'memcached-hash.o (see devtools/clean-whitespace.pl)'
> #   at t/whitespace.t line 39.
>
> #   Failed test 'memcached-items.o (see devtools/clean-whitespace.pl)'
> #   at t/whitespace.t line 39.
>
> #   Failed test 'memcached-memcached.o (see devtools/clean-
> whitespace.pl)'
> #   at t/whitespace.t line 39.
>
> #   Failed test 'memcached-slabs.o (see devtools/clean-whitespace.pl)'
> #   at t/whitespace.t line 39.
>
> #   Failed test 'memcached-stats.o (see devtools/clean-whitespace.pl)'
> #   at t/whitespace.t line 39.
>
> #   Failed test 'memcached-thread.o (see devtools/clean-whitespace.pl)'
> #   at t/whitespace.t line 39.
>
> #   Failed test 'memcached-util.o (see devtools/clean-whitespace.pl)'
> #   at t/whitespace.t line 39.
>
> #   Failed test 'memcached_debug-assoc.o (see devtools/clean-
> whitespace.pl)'
> #   at t/whitespace.t line 39.
>
> #   Failed test 'memcached_debug-daemon.o (see devtools/clean-
> whitespace.pl)'
> #   at t/whitespace.t line 39.
>
> #   Failed test 'memcached_debug-hash.o (see devtools/clean-
> whitespace.pl)'
> #   at t/whitespace.t line 39.
>
> #   Failed test 'memcached_debug-items.o (see devtools/clean-
> whitespace.pl)'
> #   at t/whitespace.t line 39.
>
> #   Failed test 'memcached_debug-memcached.o (see devtools/clean-
> whitespace.pl)'
> #   at t/whitespace.t line 39.
>
> #   Failed test 'memcached_debug-slabs.o (see devtools/clean-
> whitespace.pl)'
> #   at t/whitespace.t line 39.
>
> #   Failed test 'memcached_debug-stats.o (see devtools/clean-
> whitespace.pl)'
> #   at t/whitespace.t line 39.
>
> #   Failed test 'memcached_debug-thread.o (see devtools/clean-
> whitespace.pl)'
> #   at t/whitespace.t line 39.
>
> #   Failed test 'memcached_debug-util.o (see devtools/clean-
> whitespace.pl)'
> #   at t/whitespace.t line 39.
>
> #   Failed test 'sizes (see devtools/clean-whitespace.pl)'
> #   at t/whitespace.t line 39.
>
> #   Failed test 'sizes.o (see devtools/clean-whitespace.pl)'
> #   at t/whitespace.t line 39.
>
> #   Failed test 'testapp (see devtools/clean-whitespace.pl)'
> #   at t/whitespace.t line 39.
>
> #   Failed test 'testapp.o (see devtools/clean-whitespace.pl)'
> #   at t/whitespace.t line 39.
>
> #   Failed test 'timedrun (see devtools/clean-whitespace.pl)'
> #   at t/whitespace.t line 39.
>
> #   Failed test 'timedrun.o (see devtools/clean-whitespace.pl)'
> #   at t/whitespace.t line 39.
>
> #   Failed test 'util.o (see devtools/clean-whitespace.pl)'
> #   at t/whitespace.t line 39.
>
> #   Failed test 'Makefile.in (see devtools/clean-whitespace.pl)'
> #   at t/whitespace.t line 39.
>
> #   Failed test 'aclocal.m4 (see devtools/clean-whitespace.pl)'
> #   at t/whitespace.t line 39.
>
> #   Failed test 'compile (see devtools/clean-whitespace.pl)'
> #   at t/whitespace.t line 39.
>
> #   Failed test 'config.guess (see devtools/clean-whitespace.pl)'
> #   at t/whitespace.t line 39.
>
> #   Failed test 'config.h.in (see devtools/clean-whitespace.pl)'
> #   at t/whitespace.t line 39.
>
> #   Failed test 'config.sub (see devtools/clean-whitespace.pl)'
> #   at t/whitespace.t line 39.
>
> #   Failed test 'configure (see devtools/clean-whitespace.pl)'
> #   at t/whitespace.t line 39.
>
> #   Failed test 'depcomp (see devtools/clean-whitespace.pl)'
> #   at t/whitespace.t line 39.
>
> #   Failed test 'doc/Makefile (see devtools/clean-whitespace.pl)'
> #   at t/whitespace.t line 39.
>
> #   Failed test 'doc/Makefile.in (see devtools/clean-whitespace.pl)'
> #   at t/whitespace.t line 39.
>
> #   Failed test 'install-sh (see devtools/clean-whitespace.pl)'
> #   at t/whitespace.t line 39.
>
> #   Failed test 'missing (see devtools/clean-whitespace.pl)'
> #   at t/whitespace.t line 39.
> t/whitespace.t ....... 152/168
> #   Failed test 'doc/Makefile (see devtools/clean-whitespace.pl)'
> #   at t/whitespace.t line 39.
> # Looks like you failed 45 tests of 168.
> t/whitespace.t ....... Dubious, test returned 45 (wstat 11520, 0x2d00)
> Failed 45/168 subtests
>
> Test Summary Report
> -------------------
> t/binary.t         (Wstat: 65280 Tests: 258 Failed: 6)
>    Failed tests:  240, 243-244, 251, 255, 258
>    Non-zero exit status: 255
>    Parse errors: Bad plan.  You planned 3361 tests but ran 258.
> t/whitespace.t     (Wstat: 11520 Tests: 168 Failed: 45)
>    Failed tests:  30-56, 58-62, 65, 68, 73-77, 80, 83-84
>                  95, 102, 168
>    Non-zero exit status: 45
> Files=39, Tests=3540, 79 wallclock secs ( 8.33 usr  0.73 sys + 35.99  
> cusr 13.22 csys = 58.27 CPU)
> Result: FAIL
> gmake[2]: *** [test] Error 1
> gmake[2]: Leaving directory `/home/dam/mgar/pkg/memcached/trunk/work/
> solaris9-sparc/build-isa-sparcv8/memcached-1.4.5'
> gmake[1]: *** [test-work/solaris9-sparc/build-isa-sparcv8/
> memcached-1.4.5/Makefile] Error 2
> gmake[1]: Leaving directory `/home/dam/mgar/pkg/memcached/trunk'
> gmake: *** [merge-isa-sparcv8] Error 2
>
> Best regards
>
>    -- Dago
Dagobert Michelsen
Re: Also failing tests of 1.4.5 on Solaris 9 Sparc
August 12, 2010 09:20PM
Hi Dustin,

Am 12.08.2010 um 18:25 schrieb Dustin:
> We don't have anyone working on sparc at the moment. Would love
> fixes. :)

You haven't? What happend to Trond Norbye? Anyway, if anyone is
interested
in developing memcached on Solaris I can offer an account on the OpenCSW
buildfarm which is equipped with Solaris 8/9/10 Sparc and x86 and Sun
Studio 11/12/12u1 + GCC3/GCC4 compilers for compatibility testing.
I for myself are mainly working on packaging for Solaris and elaborate
porting work is usually not possible in my timeframe.
http://www.opencsw.org/extend-it/signup/to-upstream-maintainers/


Best regards

-- Dago
On Aug 12, 12:12 pm, Dagobert Michelsen <[email protected]> wrote:
> You haven't? What happend to Trond Norbye? Anyway, if anyone is  
> interested
> in developing memcached on Solaris I can offer an account on the OpenCSW
> buildfarm which is equipped with Solaris 8/9/10 Sparc and x86 and Sun
> Studio 11/12/12u1 + GCC3/GCC4 compilers for compatibility testing.
> I for myself are mainly working on packaging for Solaris and elaborate
> porting work is usually not possible in my timeframe.
>    http://www.opencsw.org/extend-it/signup/to-upstream-maintainers/

Trond's working on Solaris/intel which is working OK.

We have a Solaris 10 sparc builder, but it's not being very well
maintained and nobody's diagnosed the build failures over there
lately. It *should* work, but some things clearly do not.
Matt Ingenthron
Re: Also failing tests of 1.4.5 on Solaris 9 Sparc
August 13, 2010 02:51AM
Dagobert Michelsen wrote:
> Hi Dustin,
>
> Am 12.08.2010 um 18:25 schrieb Dustin:
>> We don't have anyone working on sparc at the moment. Would love
>> fixes. :)
>
> You haven't? What happend to Trond Norbye?

Trond is still doing Solaris development, but has been working on other
stuff of late. Still on Solaris though. :)

We do want to get all of the builders up to snuff.
> Anyway, if anyone is interested
> in developing memcached on Solaris I can offer an account on the OpenCSW
> buildfarm which is equipped with Solaris 8/9/10 Sparc and x86 and Sun
> Studio 11/12/12u1 + GCC3/GCC4 compilers for compatibility testing.
> I for myself are mainly working on packaging for Solaris and elaborate
> porting work is usually not possible in my timeframe.
> http://www.opencsw.org/extend-it/signup/to-upstream-maintainers/
>
>
> Best regards
>
> -- Dago
Sorry, only registered users may post in this forum.

Click here to login